[Carbon-dev] "WSO2 Carbon Continuous Build has FAILED"

WSO2 Builder builder at wso2.org
Tue Mar 8 06:20:45 PST 2011


[INFO] [compiler:compile {execution: default-compile}]
Compiling 42 source files to /home/carbon/stratos/carbon/dependencies/synapse/modules/transports/core/nhttp/target/classes
[INFO] [dependency:copy {execution: copy}]
[INFO] Configured Artifact: org.aspectj:aspectjweaver:?:jar
[INFO] Copying aspectjweaver-1.6.1.jar to /home/carbon/stratos/carbon/dependencies/synapse/modules/transports/core/nhttp/target/lib/aspectjweaver.jar
[INFO] [resources:testResources {execution: default-testResources}]
[INFO] Using encoding: 'UTF-8' to copy filtered resources.
[INFO] [compiler:testCompile {execution: default-testCompile}]
[INFO] Not compiling test sources
[INFO] [surefire:test {execution: default-test}]
[INFO] Tests are skipped.
[INFO] [bundle:bundle {execution: default-bundle}]
[INFO] [install:install {execution: default-install}]
[INFO] Installing /home/carbon/stratos/carbon/dependencies/synapse/modules/transports/core/nhttp/target/synapse-nhttp-transport-2.1.0-SNAPSHOT.jar to /home/carbon/.m2/repository/org/apache/synapse/synapse-nhttp-transport/2.1.0-SNAPSHOT/synapse-nhttp-transport-2.1.0-SNAPSHOT.jar
[INFO] [bundle:install {execution: default-install}]
[INFO] Parsing file:/home/carbon/.m2/repository/repository.xml
[INFO] Installing org/apache/synapse/synapse-nhttp-transport/2.1.0-SNAPSHOT/synapse-nhttp-transport-2.1.0-SNAPSHOT.jar
[INFO] Writing OBR metadata
[INFO] ------------------------------------------------------------------------
[INFO] Building Apache Synapse - PIPE Transport
[INFO]    task-segment: [clean, install]
[INFO] ------------------------------------------------------------------------
[INFO] [clean:clean {execution: default-clean}]
[INFO] Deleting directory /home/carbon/stratos/carbon/dependencies/synapse/modules/transports/core/pipe/target
[INFO] [remote-resources:process {execution: default}]
[INFO] [resources:resources {execution: default-resources}]
[INFO] Using encoding: 'UTF-8' to copy filtered resources.
[INFO] [compiler:compile {execution: default-compile}]
Compiling 9 source files to /home/carbon/stratos/carbon/dependencies/synapse/modules/transports/core/pipe/target/classes
[INFO] ------------------------------------------------------------------------
[ERROR] BUILD FAILURE
[INFO] ------------------------------------------------------------------------
[INFO] Compilation failure

/home/carbon/stratos/carbon/dependencies/synapse/modules/transports/core/pipe/src/main/java/org/apache/synapse/transport/pipe/PipeEndpoint.java:[33,7] org.apache.synapse.transport.pipe.PipeEndpoint is not abstract and does not override abstract method getEndpointReferences(java.lang.String) in org.apache.axis2.transport.base.ProtocolEndpoint

/home/carbon/stratos/carbon/dependencies/synapse/modules/transports/core/pipe/src/main/java/org/apache/synapse/transport/pipe/PipeEndpoint.java:[59,4] method does not override or implement a method from a supertype

/home/carbon/stratos/carbon/dependencies/synapse/modules/transports/core/pipe/src/main/java/org/apache/synapse/transport/pipe/PipeEndpointListener.java:[107,28] receive(java.net.SocketAddress,org.apache.axis2.transport.base.datagram.DatagramEndpoint,byte[],int) in org.apache.axis2.transport.base.datagram.DatagramDispatcherCallback cannot be applied to (org.apache.synapse.transport.pipe.PipeEndpoint,byte[],int,<nulltype>)

/home/carbon/stratos/carbon/dependencies/synapse/modules/transports/core/pipe/src/main/java/org/apache/synapse/transport/pipe/PipeListener.java:[59,45] cannot find symbol
symbol  : method getTransportInDescription()
location: class org.apache.synapse.transport.pipe.PipeListener

/home/carbon/stratos/carbon/dependencies/synapse/modules/transports/core/pipe/src/main/java/org/apache/synapse/transport/pipe/PipeListener.java:[57,4] method does not override or implement a method from a supertype


[INFO] ------------------------------------------------------------------------
[INFO] For more information, run Maven with the -e switch
[INFO] ------------------------------------------------------------------------
[INFO] Total time: 39 minutes 44 seconds
[INFO] Finished at: Tue Mar 08 19:50:38 IST 2011
[INFO] Final Memory: 1076M/1894M
[INFO] ------------------------------------------------------------------------


More information about the Carbon-dev mailing list